Reaction Details
TargetReceptor-type tyrosine-protein kinase FLT3
LigandBDBM50300690
Substrate/Competitorn/a
Meas. Tech.ChEMBL_1505363 (CHEMBL3595189)
IC50 69±n/a nM
Citation Chen, CTHsu, JTLin, WHLu, CTYen, SCHsu, THuang, YLSong, JSChen, CHChou, LHYen, KJChen, CPKuo, PCHuang, CLLiu, HEChao, YSYeh, TKJiaang, WT Identification of a potent 5-phenyl-thiazol-2-ylamine-based inhibitor of FLT3 with activity against drug resistance-conferring point mutations. Eur J Med Chem100:151-61 (2015) 
 
Receptor-type tyrosine-protein kinase FLT3
Name:Receptor-type tyrosine-protein kinase FLT3
Type:Enzyme
Mol. Mass.:112888.62
Organism:Homo sapiens (Human)
Description:P36888
Residue:993
BDBM50300690
NameBDBM50300690
Synonyms:1-(5-Tert-Butyl-1,2-Oxazol-3-Yl)-3-(4-{7-[2-(Morpholin-4-Yl)ethoxy]imidazo[2,1-B][1,3]benzothiazol-2-Yl}phenyl)urea AC 220 AC010220 ASP-2689 N-(5-tert-Butyl-isoxazol-3-yl)-N'-{4-[7-(2-morpholin-4-yl-ethoxy)imidazo[2,1-b][1,3]benzothiazol-2-yl]phenyl}urea Quizartinib (AC220) US11542261, Compound quizartinib | US9216997, Quizartinib (positive compound)
TypeSmall organic molecule
Emp. Form.C29H32N6O4S
Mol. Mass.560.667
SMILESCC(C)(C)c1cc(NC(=O)Nc2ccc(cc2)-c2cn3c(n2)sc2cc(OCCN4CCOCC4)ccc32)no1