Reaction Details
TargetReceptor-type tyrosine-protein kinase FLT3
LigandBDBM50096114
Substrate/Competitorn/a
Meas. Tech.ChEMBL_1505363 (CHEMBL3595189)
IC50 79±n/a nM
Citation Chen, CTHsu, JTLin, WHLu, CTYen, SCHsu, THuang, YLSong, JSChen, CHChou, LHYen, KJChen, CPKuo, PCHuang, CLLiu, HEChao, YSYeh, TKJiaang, WT Identification of a potent 5-phenyl-thiazol-2-ylamine-based inhibitor of FLT3 with activity against drug resistance-conferring point mutations. Eur J Med Chem100:151-61 (2015) 
 
Receptor-type tyrosine-protein kinase FLT3
Name:Receptor-type tyrosine-protein kinase FLT3
Type:Enzyme
Mol. Mass.:112888.62
Organism:Homo sapiens (Human)
Description:P36888
Residue:993
BDBM50096114
NameBDBM50096114
Synonyms:CHEMBL3593283
TypeSmall organic molecule
Emp. Form.C26H28N8OS
Mol. Mass.500.619
SMILESCN1CCN(CC1)c1cc(Nc2ncc(s2)-c2ccc(NC(=O)Nc3ccccc3)cc2)nc(C)n1