Reaction Details
TargetAurora kinase A
LigandBDBM50096124
Substrate/Competitorn/a
Meas. Tech.ChEMBL_1505365 (CHEMBL3595191)
IC50 270±n/a nM
Citation Chen, CTHsu, JTLin, WHLu, CTYen, SCHsu, THuang, YLSong, JSChen, CHChou, LHYen, KJChen, CPKuo, PCHuang, CLLiu, HEChao, YSYeh, TKJiaang, WT Identification of a potent 5-phenyl-thiazol-2-ylamine-based inhibitor of FLT3 with activity against drug resistance-conferring point mutations. Eur J Med Chem100:151-61 (2015) 
 
Aurora kinase A
Name:Aurora kinase A
Type:Serine/threonine-protein kinase
Mol. Mass.:45830.98
Organism:Homo sapiens (Human)
Description:O14965
Residue:403
BDBM50096124
NameBDBM50096124
Synonyms:CHEMBL3593286
TypeSmall organic molecule
Emp. Form.C25H25ClN8OS
Mol. Mass.521.037
SMILESCc1nc(Nc2ncc(s2)-c2ccc(NC(=O)Nc3cccc(Cl)c3)cc2)cc(n1)N1CCNCC1