Reaction Details
TargetEphrin type-A receptor 3
LigandBDBM50100317
Substrate/Competitorn/a
Meas. Tech.ChEMBL_1454051 (CHEMBL3361797)
Kd 39.3±n/a nM
Citation Unzue, ADong, JLafleur, KZhao, HFrugier, ECaflisch, ANevado, C Pyrrolo[3,2-b]quinoxaline derivatives as types I1/2 and II Eph tyrosine kinase inhibitors: structure-based design, synthesis, and in vivo validation. J Med Chem57:6834-44 (2014) 
 
Ephrin type-A receptor 3
Name:Ephrin type-A receptor 3
Type:Protein
Mol. Mass.:110131.95
Organism:Homo sapiens (Human)
Description:P29320
Residue:983
BDBM50100317
NameBDBM50100317
Synonyms:CHEMBL3321822
TypeSmall organic molecule
Emp. Form.C25H18F3N7O2
Mol. Mass.505.4513
SMILESNC(=O)c1c(N)n(-c2ccc(NC(=O)Nc3cccc(c3)C(F)(F)F)cc2)c2nc3ccccc3nc12