Reaction Details
TargetNociceptin receptor
LigandBDBM50100985
Substrate/Competitorn/a
Meas. Tech.ChEMBL_1452449 (CHEMBL3362473)
Ki 1600±n/a nM
Citation Schunk, SLinz, KFrormann, SHinze, COberbörsch, SSundermann, BZemolka, SEnglberger, WGermann, TChristoph, TKögel, BYSchröder, WHarlfinger, SSaunders, DKless, ASchick, HSonnenschein, H Discovery of Spiro[cyclohexane-dihydropyrano[3,4-b]indole]-amines as Potent NOP and Opioid Receptor Agonists. ACS Med Chem Lett5:851-6 (2014) 
 
Nociceptin receptor
Name:Nociceptin receptor
Type:G Protein-Coupled Receptor (GPCR)
Mol. Mass.:40702.87
Organism:Homo sapiens (Human)
Description:P41146
Residue:370
BDBM50100985
NameBDBM50100985
Synonyms:CHEMBL3325746
TypeSmall organic molecule
Emp. Form.C21H28ClNO
Mol. Mass.345.906
SMILESCl.CN(C)[C@@]1(CC[C@@](O)(Cc2ccccc2)CC1)c1ccccc1