Reaction Details
TargetNociceptin receptor
LigandBDBM50100995
Substrate/Competitorn/a
Meas. Tech.ChEMBL_1452449 (CHEMBL3362473)
Ki 110±n/a nM
Citation Schunk, SLinz, KFrormann, SHinze, COberbörsch, SSundermann, BZemolka, SEnglberger, WGermann, TChristoph, TKögel, BYSchröder, WHarlfinger, SSaunders, DKless, ASchick, HSonnenschein, H Discovery of Spiro[cyclohexane-dihydropyrano[3,4-b]indole]-amines as Potent NOP and Opioid Receptor Agonists. ACS Med Chem Lett5:851-6 (2014) 
 
Nociceptin receptor
Name:Nociceptin receptor
Type:G Protein-Coupled Receptor (GPCR)
Mol. Mass.:40702.87
Organism:Homo sapiens (Human)
Description:P41146
Residue:370
BDBM50100995
NameBDBM50100995
Synonyms:CHEMBL3325883
TypeSmall organic molecule
Emp. Form.C19H31ClN2
Mol. Mass.322.916
SMILESCl.CN(C)[C@@]1(CC[C@@H](CC1)N1CCCCC1)c1ccccc1