Reaction Details
TargetMu-type opioid receptor
LigandBDBM50100990
Substrate/Competitorn/a
Meas. Tech.ChEMBL_1452451 (CHEMBL3362475)
Ki 11±n/a nM
Citation Schunk, SLinz, KFrormann, SHinze, COberbörsch, SSundermann, BZemolka, SEnglberger, WGermann, TChristoph, TKögel, BYSchröder, WHarlfinger, SSaunders, DKless, ASchick, HSonnenschein, H Discovery of Spiro[cyclohexane-dihydropyrano[3,4-b]indole]-amines as Potent NOP and Opioid Receptor Agonists. ACS Med Chem Lett5:851-6 (2014) 
 
Mu-type opioid receptor
Name:Mu-type opioid receptor
Type:G Protein-Coupled Receptor (GPCR)
Mol. Mass.:44789.51
Organism:Homo sapiens (Human)
Description:P35372
Residue:400
BDBM50100990
NameBDBM50100990
Synonyms:CHEMBL3325878
TypeSmall organic molecule
Emp. Form.C22H32Cl2N2
Mol. Mass.395.409
SMILESCl.Cl.CN(C)[C@]1(CC[C@@H](CC1)NCCc1ccccc1)c1ccccc1