Reaction Details
TargetMu-type opioid receptor
LigandBDBM50101091
Substrate/Competitorn/a
Meas. Tech.ChEMBL_1452451 (CHEMBL3362475)
Ki 9.0±n/a nM
Citation Schunk, SLinz, KFrormann, SHinze, COberbörsch, SSundermann, BZemolka, SEnglberger, WGermann, TChristoph, TKögel, BYSchröder, WHarlfinger, SSaunders, DKless, ASchick, HSonnenschein, H Discovery of Spiro[cyclohexane-dihydropyrano[3,4-b]indole]-amines as Potent NOP and Opioid Receptor Agonists. ACS Med Chem Lett5:851-6 (2014) 
 
Mu-type opioid receptor
Name:Mu-type opioid receptor
Type:G Protein-Coupled Receptor (GPCR)
Mol. Mass.:44789.51
Organism:Homo sapiens (Human)
Description:P35372
Residue:400
BDBM50101091
NameBDBM50101091
Synonyms:CHEMBL3326223
TypeSmall organic molecule
Emp. Form.C24H32Cl2FN3
Mol. Mass.452.435
SMILESCl.Cl.CN(C)[C@]1(CC[C@@H](CC1)NCCc1c[nH]c2ccc(F)cc12)c1ccccc1