Reaction Details
TargetNociceptin receptor
LigandBDBM50101090
Substrate/Competitorn/a
Meas. Tech.ChEMBL_1452457 (CHEMBL3362481)
EC50 20000±n/a nM
Citation Schunk, SLinz, KFrormann, SHinze, COberbörsch, SSundermann, BZemolka, SEnglberger, WGermann, TChristoph, TKögel, BYSchröder, WHarlfinger, SSaunders, DKless, ASchick, HSonnenschein, H Discovery of Spiro[cyclohexane-dihydropyrano[3,4-b]indole]-amines as Potent NOP and Opioid Receptor Agonists. ACS Med Chem Lett5:851-6 (2014) 
 
Nociceptin receptor
Name:Nociceptin receptor
Type:G Protein-Coupled Receptor (GPCR)
Mol. Mass.:40702.87
Organism:Homo sapiens (Human)
Description:P41146
Residue:370
BDBM50101090
NameBDBM50101090
Synonyms:CHEMBL3326222
TypeSmall organic molecule
Emp. Form.C24H33Cl2N3
Mol. Mass.434.445
SMILESCl.Cl.CN(C)[C@]1(CC[C@@H](CC1)NCCc1c[nH]c2ccccc12)c1ccccc1