Reaction Details
TargetVoltage-dependent L-type calcium channel subunit alpha-1C/alpha-1D/alpha-1S
LigandBDBM50101095
Substrate/Competitorn/a
Meas. Tech.ChEMBL_1453356 (CHEMBL3366640)
Ki 800±n/a nM
Citation Schunk, SLinz, KHinze, CFrormann, SOberbörsch, SSundermann, BZemolka, SEnglberger, WGermann, TChristoph, TKögel, BYSchröder, WHarlfinger, SSaunders, DKless, ASchick, HSonnenschein, H Discovery of a Potent Analgesic NOP and Opioid Receptor Agonist: Cebranopadol. ACS Med Chem Lett5:857-62 (2014) 
 
Voltage-dependent L-type calcium channel subunit alpha-1C/alpha-1D/alpha-1S
Name:Voltage-dependent L-type calcium channel subunit alpha-1C/alpha-1D/alpha-1S
Synonyms:Voltage-gated L-type calcium channel
Type:n/a
Mol. Mass.:n/a
Description:ASSAY_ID of ChEMBL is 92765
Components:This complex has 3 components.
Component 1
Name:Voltage-dependent L-type calcium channel subunit alpha-1D
Type:PROTEIN
Mol. Mass.:250148.41
Organism:Rattus norvegicus
Description:ChEMBL_44709
Residue:2203
Component 2
Name:Voltage-dependent L-type calcium channel subunit alpha-1C
Synonyms:CAC1C_RAT Cacn2 Cacnl1a1 Calcium channel (Type L) Calcium channel, L type, alpha-1 polypeptide, isoform 1, cardiac muscle RBC Voltage-dependent L-type calcium channel subunit alpha-1C Voltage-gated L-type calcium channel alpha-1C subunit | Voltage-gated calcium channel subunit alpha Cav1.2
Type:Enzyme Catalytic Domain
Mol. Mass.:243492.26
Organism:RAT
Description:Calcium channel 0 RAT::P22002
Residue:2169
Component 3
Name:Voltage-dependent L-type calcium channel subunit alpha-1S
Synonyms:CAC1S_RAT Cacn1 Cacnl1a3 Cchl1a3 Voltage-gated L-type calcium channel Voltage-gated calcium channel subunit alpha Cav1.1
Type:PROTEIN
Mol. Mass.:210392.58
Organism:Rattus norvegicus
Description:ChEMBL_92777
Residue:1850
BDBM50101095
NameBDBM50101095
Synonyms:CHEMBL3325957
TypeSmall organic molecule
Emp. Form.C30H35FN2O8
Mol. Mass.570.6059
SMILESOC(=O)CC(O)(CC(O)=O)C(O)=O.CN(C)[C@]1(CC[C@@]2(CC1)OCCc1c2[nH]c2ccc(F)cc12)c1ccccc1