Reaction Details
TargetNociceptin receptor
LigandBDBM50101152
Substrate/Competitorn/a
Meas. Tech.ChEMBL_1453323 (CHEMBL3366607)
Ki 1.1±n/a nM
Citation Schunk, SLinz, KHinze, CFrormann, SOberbörsch, SSundermann, BZemolka, SEnglberger, WGermann, TChristoph, TKögel, BYSchröder, WHarlfinger, SSaunders, DKless, ASchick, HSonnenschein, H Discovery of a Potent Analgesic NOP and Opioid Receptor Agonist: Cebranopadol. ACS Med Chem Lett5:857-62 (2014) 
 
Nociceptin receptor
Name:Nociceptin receptor
Type:G Protein-Coupled Receptor (GPCR)
Mol. Mass.:40702.87
Organism:Homo sapiens (Human)
Description:P41146
Residue:370
BDBM50101152
NameBDBM50101152
Synonyms:CHEMBL3326232
TypeSmall organic molecule
Emp. Form.C29H34N2O8
Mol. Mass.538.5889
SMILESOC(=O)CC(O)(CC(O)=O)C(O)=O.CN[C@]1(CC[C@@]2(CC1)OCCc1c2[nH]c2ccccc12)c1ccccc1