Reaction Details
TargetNociceptin receptor
LigandBDBM50101161
Substrate/Competitorn/a
Meas. Tech.ChEMBL_1453323 (CHEMBL3366607)
Ki 3.7±n/a nM
Citation Schunk, SLinz, KHinze, CFrormann, SOberbörsch, SSundermann, BZemolka, SEnglberger, WGermann, TChristoph, TKögel, BYSchröder, WHarlfinger, SSaunders, DKless, ASchick, HSonnenschein, H Discovery of a Potent Analgesic NOP and Opioid Receptor Agonist: Cebranopadol. ACS Med Chem Lett5:857-62 (2014) 
 
Nociceptin receptor
Name:Nociceptin receptor
Type:G Protein-Coupled Receptor (GPCR)
Mol. Mass.:40702.87
Organism:Homo sapiens (Human)
Description:P41146
Residue:370
BDBM50101161
NameBDBM50101161
Synonyms:CHEMBL3326230
TypeSmall organic molecule
Emp. Form.C30H36N2O7S
Mol. Mass.568.681
SMILESOC(=O)CC(O)(CC(O)=O)C(O)=O.CN(C)[C@]1(CC[C@@]2(CC1)SCCc1c2[nH]c2ccccc12)c1ccccc1