Reaction Details
TargetNociceptin receptor
LigandBDBM50101306
Substrate/Competitorn/a
Meas. Tech.ChEMBL_1453323 (CHEMBL3366607)
Ki 0.550000±n/a nM
Citation Schunk, SLinz, KHinze, CFrormann, SOberbörsch, SSundermann, BZemolka, SEnglberger, WGermann, TChristoph, TKögel, BYSchröder, WHarlfinger, SSaunders, DKless, ASchick, HSonnenschein, H Discovery of a Potent Analgesic NOP and Opioid Receptor Agonist: Cebranopadol. ACS Med Chem Lett5:857-62 (2014) 
 
Nociceptin receptor
Name:Nociceptin receptor
Type:G Protein-Coupled Receptor (GPCR)
Mol. Mass.:40702.87
Organism:Homo sapiens (Human)
Description:P41146
Residue:370
BDBM50101306
NameBDBM50101306
Synonyms:CHEMBL3326229
TypeSmall organic molecule
Emp. Form.C25H32ClN3
Mol. Mass.409.995
SMILESCl.CN(C)[C@]1(CC[C@@]2(CC1)N(C)CCc1c2[nH]c2ccccc12)c1ccccc1