Reaction Details
TargetHistone deacetylase 1
LigandBDBM50101331
Substrate/Competitorn/a
Meas. Tech.ChEMBL_1455095 (CHEMBL3366351)
IC50 0.300000±n/a nM
Citation Salvador, LAPark, HAl-Awadhi, FHLiu, YKim, BZeller, SLChen, QYHong, JLuesch, H Modulation of Activity Profiles for Largazole-Based HDAC Inhibitors through Alteration of Prodrug Properties. ACS Med Chem Lett5:905-10 (2014) 
 
Histone deacetylase 1
Name:Histone deacetylase 1
Type:Enzyme
Mol. Mass.:55090.27
Organism:Homo sapiens (Human)
Description:Q13547
Residue:482
BDBM50101331
NameBDBM50101331
Synonyms:CHEMBL3329621
TypeSmall organic molecule
Emp. Form.C42H54N8O8S6
Mol. Mass.991.317
SMILESCC(C)[C@@H]1NC(=O)[C@]2(C)CSC(=N2)c2csc(CNC(=O)C[C@H](OC1=O)\C=C\CCSSCC\C=C\[C@@H]1CC(=O)NCc3nc(cs3)C3=N[C@@](C)(CS3)C(=O)N[C@@H](C(C)C)C(=O)O1)n2