Reaction Details
TargetHistone deacetylase 1
LigandBDBM50101330
Substrate/Competitorn/a
Meas. Tech.ChEMBL_1455095 (CHEMBL3366351)
IC50 0.400000±n/a nM
Citation Salvador, LAPark, HAl-Awadhi, FHLiu, YKim, BZeller, SLChen, QYHong, JLuesch, H Modulation of Activity Profiles for Largazole-Based HDAC Inhibitors through Alteration of Prodrug Properties. ACS Med Chem Lett5:905-10 (2014) 
 
Histone deacetylase 1
Name:Histone deacetylase 1
Type:Enzyme
Mol. Mass.:55090.27
Organism:Homo sapiens (Human)
Description:Q13547
Residue:482
BDBM50101330
NameBDBM50101330
Synonyms:CHEMBL3329622
TypeSmall organic molecule
Emp. Form.C33H49N5O8S4
Mol. Mass.772.031
SMILESCC(C)[C@@H]1NC(=O)[C@]2(C)CSC(=N2)c2csc(CNC(=O)C[C@H](OC1=O)\C=C\CCSSC[C@H](NC(=O)OC(C)(C)C)C(=O)OC(C)(C)C)n2