Reaction Details
TargetProto-oncogene tyrosine-protein kinase Src
LigandBDBM50102903
Substrate/Competitorn/a
Meas. Tech.ChEMBL_1461196 (CHEMBL3395759)
Ki 130±n/a nM
Citation Tintori, CFallacara, ALRadi, MZamperini, CDreassi, ECrespan, EMaga, GSchenone, SMusumeci, FBrullo, CRichters, AGasparrini, FAngelucci, AFestuccia, CDelle Monache, SRauh, DBotta, M Combining X-ray crystallography and molecular modeling toward the optimization of pyrazolo[3,4-d]pyrimidines as potent c-Src inhibitors active in vivo against neuroblastoma. J Med Chem58:347-61 (2015) 
 
Proto-oncogene tyrosine-protein kinase Src
Name:Proto-oncogene tyrosine-protein kinase Src
Type:Protein
Mol. Mass.:59838.60
Organism:Homo sapiens (Human)
Description:P12931
Residue:536
BDBM50102903
NameBDBM50102903
Synonyms:CHEMBL3394092
TypeSmall organic molecule
Emp. Form.C25H26BrClN6OS
Mol. Mass.573.936
SMILESClC(Cn1ncc2c(Nc3cccc(Br)c3)nc(SCCN3CCOCC3)nc12)c1ccccc1