Reaction Details
TargetTyrosine-protein kinase ABL1
LigandBDBM50102872
Substrate/Competitorn/a
Meas. Tech.ChEMBL_1461197 (CHEMBL3395760)
Ki 150±n/a nM
Citation Tintori, CFallacara, ALRadi, MZamperini, CDreassi, ECrespan, EMaga, GSchenone, SMusumeci, FBrullo, CRichters, AGasparrini, FAngelucci, AFestuccia, CDelle Monache, SRauh, DBotta, M Combining X-ray crystallography and molecular modeling toward the optimization of pyrazolo[3,4-d]pyrimidines as potent c-Src inhibitors active in vivo against neuroblastoma. J Med Chem58:347-61 (2015) 
 
Tyrosine-protein kinase ABL1
Name:Tyrosine-protein kinase ABL1
Type:Enzyme
Mol. Mass.:122897.30
Organism:Homo sapiens (Human)
Description:P00519
Residue:1130
BDBM50102872
NameBDBM50102872
Synonyms:CHEMBL3394083
TypeSmall organic molecule
Emp. Form.C20H18ClN5OS
Mol. Mass.411.908
SMILESCSc1nc(Nc2cccc(O)c2)c2cnn(CC(Cl)c3ccccc3)c2n1