Reaction Details
TargetTyrosine-protein kinase ABL1
LigandBDBM50101585
Substrate/Competitorn/a
Meas. Tech.ChEMBL_1461197 (CHEMBL3395760)
Ki 130±n/a nM
Citation Tintori, CFallacara, ALRadi, MZamperini, CDreassi, ECrespan, EMaga, GSchenone, SMusumeci, FBrullo, CRichters, AGasparrini, FAngelucci, AFestuccia, CDelle Monache, SRauh, DBotta, M Combining X-ray crystallography and molecular modeling toward the optimization of pyrazolo[3,4-d]pyrimidines as potent c-Src inhibitors active in vivo against neuroblastoma. J Med Chem58:347-61 (2015) 
 
Tyrosine-protein kinase ABL1
Name:Tyrosine-protein kinase ABL1
Type:Enzyme
Mol. Mass.:122897.30
Organism:Homo sapiens (Human)
Description:P00519
Residue:1130
BDBM50101585
NameBDBM50101585
Synonyms:CHEMBL3393986
TypeSmall organic molecule
Emp. Form.C25H29ClN6O2S
Mol. Mass.513.055
SMILESCl.Oc1cccc(Nc2nc(SCCN3CCOCC3)nc3n(CCc4ccccc4)ncc23)c1