Reaction Details
TargetCoagulation factor XI
LigandBDBM50103216
Substrate/Competitorn/a
Meas. Tech.ChEMBL_1461137 (CHEMBL3395462)
Ki 12±n/a nM
Citation Corte, JRFang, THangeland, JJFriends, TJRendina, ARLuettgen, JMBozarth, JMBarbera, FARossi, KAWei, ARamamurthy, VMorin, PESeiffert, DAWexler, RRQuan, ML Pyridine and pyridinone-based factor XIa inhibitors. Bioorg Med Chem Lett25:925-30 (2015) 
 
Coagulation factor XI
Name:Coagulation factor XI
Type:Enzyme
Mol. Mass.:70130.58
Organism:Homo sapiens (Human)
Description:P03951
Residue:625
BDBM50103216
NameBDBM50103216
Synonyms:CHEMBL3393373
TypeSmall organic molecule
Emp. Form.C25H29ClN4O
Mol. Mass.436.977
SMILESNC[C@H]1CC[C@@H](CC1)C(=O)N[C@@H](Cc1ccccc1)c1nc(c(Cl)[nH]1)-c1ccccc1