Reaction Details
TargetCysteinyl leukotriene receptor 2
LigandBDBM50104865
Substrate/Competitorn/a
Meas. Tech.ChEMBL_1506283 (CHEMBL3599261)
IC50 4.7±n/a nM
Citation Itadani, SYashiro, KAratani, YSekiguchi, TKinoshita, AMoriguchi, HOhta, NTakahashi, SIshida, ATajima, YHisaichi, KIma, MUeda, JEgashira, HSekioka, TKadode, MYonetomi, YNakao, TInoue, ANomura, HKitamine, TFujita, MNabe, TYamaura, YMatsumura, NImagawa, ANakayama, YTakeuchi, JOhmoto, K Discovery of Gemilukast (ONO-6950), a Dual CysLT1 and CysLT2 Antagonist As a Therapeutic Agent for Asthma. J Med Chem58:6093-113 (2015) 
 
Cysteinyl leukotriene receptor 2
Name:Cysteinyl leukotriene receptor 2
Type:Enzyme Catalytic Domain
Mol. Mass.:39657.52
Organism:Homo sapiens (Human)
Description:Leukotriene Cysteinyl 2 CYSLTR2 HUMAN::Q9NS75
Residue:346
BDBM50104865
NameBDBM50104865
Synonyms:CHEMBL3597528
TypeSmall organic molecule
Emp. Form.C33H35NO5
Mol. Mass.525.6347
SMILESCc1c(CCCC(O)=O)c2cccc(\C=C\c3ccc(OCCCCc4ccccc4)cc3)c2n1CC(O)=O