Reaction Details
TargetMelanin-concentrating hormone receptor 1
LigandBDBM50106603
Substrate/Competitorn/a
Meas. Tech.ChEMBL_1508608 (CHEMBL3602719)
IC50 10.0±n/a nM
Citation Roth, GJHeckel, AKley, JTLehmann, TMüller, SGOost, TRudolf, KArndt, KBudzinski, RLenter, MLotz, RRSchindler, MThomas, LStenkamp, D Design, synthesis and evaluation of MCH receptor 1 antagonists--Part II: Optimization of pyridazines toward reduced phospholipidosis and hERG inhibition. Bioorg Med Chem Lett25:3270-4 (2015) 
 
Melanin-concentrating hormone receptor 1
Name:Melanin-concentrating hormone receptor 1
Type:G Protein-Coupled Receptor (GPCR)
Mol. Mass.:45976.27
Organism:Homo sapiens (Human)
Description:Membranes from CHO-K1 cells stably expressing human MCH1R were used in assays.
Residue:422
BDBM50106603
NameBDBM50106603
Synonyms:CHEMBL3601047
TypeSmall organic molecule
Emp. Form.C27H32N4O3
Mol. Mass.460.568
SMILESCC(=O)NC1CCN(Cc2ccc(OCCCc3ccc(Oc4ccccc4)nn3)cc2)CC1