Reaction Details
TargetMelanin-concentrating hormone receptor 1
LigandBDBM50107339
Substrate/Competitorn/a
Meas. Tech.ChEMBL_1509093 (CHEMBL3602616)
IC50 7.0±n/a nM
Citation Oost, THeckel, AKley, JTLehmann, TMüller, SRoth, GJRudolf, KArndt, KBudzinski, RLenter, MLotz, RRMaier, GMMarkert, MThomas, LStenkamp, D Design, synthesis and evaluation of MCH receptor 1 antagonists--Part III: Discovery of pre-clinical development candidate BI 186908. Bioorg Med Chem Lett25:3275-80 (2015) 
 
Melanin-concentrating hormone receptor 1
Name:Melanin-concentrating hormone receptor 1
Type:G Protein-Coupled Receptor (GPCR)
Mol. Mass.:45976.27
Organism:Homo sapiens (Human)
Description:Membranes from CHO-K1 cells stably expressing human MCH1R were used in assays.
Residue:422
BDBM50107339
NameBDBM50107339
Synonyms:CHEMBL3601294
TypeSmall organic molecule
Emp. Form.C23H26N2O2
Mol. Mass.362.4647
SMILESCN(C)Cc1ccc(CCn2ccc(OCc3ccccc3)cc2=O)cc1