Reaction Details
TargetMelanin-concentrating hormone receptor 1
LigandBDBM50107763
Substrate/Competitorn/a
Meas. Tech.ChEMBL_1509301 (CHEMBL3603114)
IC50 6.0±n/a nM
Citation Müller, SGHeckel, AKley, JTLehmann, TLustenberger, POost, TRoth, GJRudolf, KArndt, KLenter, MLotz, RRMaier, GMMarkert, MSchindler, MStenkamp, D Design, synthesis and evaluation of MCH receptor 1 antagonists--Part I: Optimization of HTS hits towards an in vivo efficacious tool compound BI 414. Bioorg Med Chem Lett25:3264-9 (2015) 
 
Melanin-concentrating hormone receptor 1
Name:Melanin-concentrating hormone receptor 1
Type:G Protein-Coupled Receptor (GPCR)
Mol. Mass.:45976.27
Organism:Homo sapiens (Human)
Description:Membranes from CHO-K1 cells stably expressing human MCH1R were used in assays.
Residue:422
BDBM50107763
NameBDBM50107763
Synonyms:CHEMBL3600806
TypeSmall organic molecule
Emp. Form.C27H29ClN2O2
Mol. Mass.448.984
SMILESCOc1cc(CCNC(=O)c2ccc(cc2)-c2ccc(Cl)cc2)ccc1CN1CCCC1