Reaction Details
TargetMelanin-concentrating hormone receptor 1
LigandBDBM50107746
Substrate/Competitorn/a
Meas. Tech.ChEMBL_1509301 (CHEMBL3603114)
IC50 7.0±n/a nM
Citation Müller, SGHeckel, AKley, JTLehmann, TLustenberger, POost, TRoth, GJRudolf, KArndt, KLenter, MLotz, RRMaier, GMMarkert, MSchindler, MStenkamp, D Design, synthesis and evaluation of MCH receptor 1 antagonists--Part I: Optimization of HTS hits towards an in vivo efficacious tool compound BI 414. Bioorg Med Chem Lett25:3264-9 (2015) 
 
Melanin-concentrating hormone receptor 1
Name:Melanin-concentrating hormone receptor 1
Type:G Protein-Coupled Receptor (GPCR)
Mol. Mass.:45976.27
Organism:Homo sapiens (Human)
Description:Membranes from CHO-K1 cells stably expressing human MCH1R were used in assays.
Residue:422
BDBM50107746
NameBDBM50107746
Synonyms:CHEMBL3600828
TypeSmall organic molecule
Emp. Form.C25H23ClN2O
Mol. Mass.402.916
SMILESClc1ccc(cc1)-c1ccc(nc1)C#Cc1ccc(OCCN2CCCC2)cc1