Reaction Details
TargetATP-dependent translocase ABCB1
LigandBDBM50109279
Substrate/Competitorn/a
Meas. Tech.ChEMBL_1508927 (CHEMBL3602146)
IC50 14±n/a nM
Citation Wang, ZWong, ILLi, FXYang, CLiu, ZJiang, TJiang, TFChow, LMWan, SB Optimization of permethyl ningalin B analogs as P-glycoprotein inhibitors. Bioorg Med Chem23:5566-73 (2015) 
 
ATP-dependent translocase ABCB1
Name:ATP-dependent translocase ABCB1
Type:Protein
Mol. Mass.:141503.50
Organism:Homo sapiens (Human)
Description:P08183
Residue:1280
BDBM50109279
NameBDBM50109279
Synonyms:CHEMBL3601684
TypeSmall organic molecule
Emp. Form.C34H28N2O10
Mol. Mass.624.5935
SMILESCOc1ccc(cc1OC)C1=C(C(=O)N(C(=O)c2ccc(OCc3ccccc3)c(c2)[N+]([O-])=O)C1=O)c1ccc(OC)c(OC)c1