Reaction Details
TargetATP-dependent translocase ABCB1
LigandBDBM50109344
Substrate/Competitorn/a
Meas. Tech.ChEMBL_1508927 (CHEMBL3602146)
IC50 11±n/a nM
Citation Wang, ZWong, ILLi, FXYang, CLiu, ZJiang, TJiang, TFChow, LMWan, SB Optimization of permethyl ningalin B analogs as P-glycoprotein inhibitors. Bioorg Med Chem23:5566-73 (2015) 
 
ATP-dependent translocase ABCB1
Name:ATP-dependent translocase ABCB1
Type:Protein
Mol. Mass.:141503.50
Organism:Homo sapiens (Human)
Description:P08183
Residue:1280
BDBM50109344
NameBDBM50109344
Synonyms:CHEMBL3601682
TypeSmall organic molecule
Emp. Form.C29H26BrNO9
Mol. Mass.612.422
SMILESCOc1ccc(cc1OC)C1=C(C(=O)N(C(=O)c2cc(Br)c(OC)cc2OC)C1=O)c1ccc(OC)c(OC)c1