Reaction Details
TargetTyrosine-protein kinase JAK3
LigandBDBM50109405
Substrate/Competitorn/a
Meas. Tech.ChEMBL_1509383 (CHEMBL3603326)
IC50 46±n/a nM
Citation Tan, LAkahane, KMcNally, RReyskens, KMFicarro, SBLiu, SHerter-Sprie, GSKoyama, SPattison, MJLabella, KJohannessen, LAkbay, EAWong, KKFrank, DAMarto, JALook, TAArthur, JSEck, MJGray, NS Development of Selective Covalent Janus Kinase 3 Inhibitors. J Med Chem58:6589-606 (2015) 
 
Tyrosine-protein kinase JAK3
Name:Tyrosine-protein kinase JAK3
Type:Protein
Mol. Mass.:125111.08
Organism:Homo sapiens (Human)
Description:P52333
Residue:1124
BDBM50109405
NameBDBM50109405
Synonyms:CHEMBL3601224
TypeSmall organic molecule
Emp. Form.C26H29ClFN7O2
Mol. Mass.526.006
SMILESCOc1cc(N2CCN(C)CC2)c(F)cc1Nc1ncc(Cl)c(NCc2cccc(NC(=O)C=C)c2)n1