Reaction Details
TargetTyrosine-protein kinase JAK3
LigandBDBM50109416
Substrate/Competitorn/a
Meas. Tech.ChEMBL_1509383 (CHEMBL3603326)
IC50 7.4±n/a nM
Citation Tan, LAkahane, KMcNally, RReyskens, KMFicarro, SBLiu, SHerter-Sprie, GSKoyama, SPattison, MJLabella, KJohannessen, LAkbay, EAWong, KKFrank, DAMarto, JALook, TAArthur, JSEck, MJGray, NS Development of Selective Covalent Janus Kinase 3 Inhibitors. J Med Chem58:6589-606 (2015) 
 
Tyrosine-protein kinase JAK3
Name:Tyrosine-protein kinase JAK3
Type:Protein
Mol. Mass.:125111.08
Organism:Homo sapiens (Human)
Description:P52333
Residue:1124
BDBM50109416
NameBDBM50109416
Synonyms:CHEMBL3601237
TypeSmall organic molecule
Emp. Form.C25H25ClF2N6O2
Mol. Mass.514.955
SMILESOC1CCN(CC1)c1c(F)cc(Nc2ncc(Cl)c(NCc3cccc(NC(=O)C=C)c3)n2)cc1F