Reaction Details
TargetTyrosine-protein kinase JAK3
LigandBDBM50109425
Substrate/Competitorn/a
Meas. Tech.ChEMBL_1509383 (CHEMBL3603326)
IC50 0.700000±n/a nM
Citation Tan, LAkahane, KMcNally, RReyskens, KMFicarro, SBLiu, SHerter-Sprie, GSKoyama, SPattison, MJLabella, KJohannessen, LAkbay, EAWong, KKFrank, DAMarto, JALook, TAArthur, JSEck, MJGray, NS Development of Selective Covalent Janus Kinase 3 Inhibitors. J Med Chem58:6589-606 (2015) 
 
Tyrosine-protein kinase JAK3
Name:Tyrosine-protein kinase JAK3
Type:Protein
Mol. Mass.:125111.08
Organism:Homo sapiens (Human)
Description:P52333
Residue:1124
BDBM50109425
NameBDBM50109425
Synonyms:CHEMBL3601108
TypeSmall organic molecule
Emp. Form.C22H24ClN7O2
Mol. Mass.453.925
SMILESClc1cnc(Nc2cnn(c2)C2CCOCC2)nc1NCc1cccc(NC(=O)C=C)c1