Reaction Details
TargetTyrosine-protein kinase JAK3
LigandBDBM50109494
Substrate/Competitorn/a
Meas. Tech.ChEMBL_1509383 (CHEMBL3603326)
IC50 390±n/a nM
Citation Tan, LAkahane, KMcNally, RReyskens, KMFicarro, SBLiu, SHerter-Sprie, GSKoyama, SPattison, MJLabella, KJohannessen, LAkbay, EAWong, KKFrank, DAMarto, JALook, TAArthur, JSEck, MJGray, NS Development of Selective Covalent Janus Kinase 3 Inhibitors. J Med Chem58:6589-606 (2015) 
 
Tyrosine-protein kinase JAK3
Name:Tyrosine-protein kinase JAK3
Type:Protein
Mol. Mass.:125111.08
Organism:Homo sapiens (Human)
Description:P52333
Residue:1124
BDBM50109494
NameBDBM50109494
Synonyms:CHEMBL3601122
TypeSmall organic molecule
Emp. Form.C26H32ClN7O2
Mol. Mass.510.031
SMILESCCC(=O)Nc1cccc(CNc2nc(Nc3ccc(cc3OC)N3CCN(C)CC3)ncc2Cl)c1