Reaction Details
TargetTyrosine-protein kinase JAK3
LigandBDBM50109506
Substrate/Competitorn/a
Meas. Tech.ChEMBL_1509383 (CHEMBL3603326)
IC50 1.6±n/a nM
Citation Tan, LAkahane, KMcNally, RReyskens, KMFicarro, SBLiu, SHerter-Sprie, GSKoyama, SPattison, MJLabella, KJohannessen, LAkbay, EAWong, KKFrank, DAMarto, JALook, TAArthur, JSEck, MJGray, NS Development of Selective Covalent Janus Kinase 3 Inhibitors. J Med Chem58:6589-606 (2015) 
 
Tyrosine-protein kinase JAK3
Name:Tyrosine-protein kinase JAK3
Type:Protein
Mol. Mass.:125111.08
Organism:Homo sapiens (Human)
Description:P52333
Residue:1124
BDBM50109506
NameBDBM50109506
Synonyms:CHEMBL3601710
TypeSmall organic molecule
Emp. Form.C21H24ClN7O2
Mol. Mass.441.914
SMILESCOCCn1cc(Nc2ncc(Cl)c(NC(C)c3cccc(NC(=O)C=C)c3)n2)cn1