Reaction Details
TargetNon-receptor tyrosine-protein kinase TYK2
LigandBDBM50109526
Substrate/Competitorn/a
Meas. Tech.ChEMBL_1509377 (CHEMBL3603320)
IC50 3120±n/a nM
Citation Tan, LAkahane, KMcNally, RReyskens, KMFicarro, SBLiu, SHerter-Sprie, GSKoyama, SPattison, MJLabella, KJohannessen, LAkbay, EAWong, KKFrank, DAMarto, JALook, TAArthur, JSEck, MJGray, NS Development of Selective Covalent Janus Kinase 3 Inhibitors. J Med Chem58:6589-606 (2015) 
 
Non-receptor tyrosine-protein kinase TYK2
Name:Non-receptor tyrosine-protein kinase TYK2
Type:Protein
Mol. Mass.:133666.03
Organism:Homo sapiens (Human)
Description:P29597
Residue:1187
BDBM50109526
NameBDBM50109526
Synonyms:CHEMBL3601862
TypeSmall organic molecule
Emp. Form.C35H47ClN10O6S
Mol. Mass.771.329
SMILES[H][C@]12CS[C@@H](CCCCC(=O)NCCOCCOCCOCCn3cc(Nc4ncc(Cl)c(NCc5cccc(NC(=O)C=C)c5)n4)cn3)[C@@]1([H])NC(=O)N2