Reaction Details
TargetTyrosine-protein kinase JAK1
LigandBDBM50109531
Substrate/Competitorn/a
Meas. Tech.ChEMBL_1509375 (CHEMBL3603318)
IC50 24±n/a nM
Citation Tan, LAkahane, KMcNally, RReyskens, KMFicarro, SBLiu, SHerter-Sprie, GSKoyama, SPattison, MJLabella, KJohannessen, LAkbay, EAWong, KKFrank, DAMarto, JALook, TAArthur, JSEck, MJGray, NS Development of Selective Covalent Janus Kinase 3 Inhibitors. J Med Chem58:6589-606 (2015) 
 
Tyrosine-protein kinase JAK1
Name:Tyrosine-protein kinase JAK1
Type:Protein
Mol. Mass.:133293.73
Organism:Homo sapiens (Human)
Description:P23458
Residue:1154
BDBM50109531
NameBDBM50109531
Synonyms:CHEMBL3601231
TypeSmall organic molecule
Emp. Form.C24H25ClN6O2
Mol. Mass.464.947
SMILESClc1cnc(Nc2ccc(cc2)N2CCOCC2)nc1NCc1cccc(NC(=O)C=C)c1