Reaction Details
TargetTyrosine-protein kinase JAK3
LigandBDBM50383274
Substrate/Competitorn/a
Meas. Tech.ChEMBL_1509498 (CHEMBL3602169)
Kd 150±n/a nM
Citation Tan, LAkahane, KMcNally, RReyskens, KMFicarro, SBLiu, SHerter-Sprie, GSKoyama, SPattison, MJLabella, KJohannessen, LAkbay, EAWong, KKFrank, DAMarto, JALook, TAArthur, JSEck, MJGray, NS Development of Selective Covalent Janus Kinase 3 Inhibitors. J Med Chem58:6589-606 (2015) 
 
Tyrosine-protein kinase JAK3
Name:Tyrosine-protein kinase JAK3
Type:Protein
Mol. Mass.:125111.08
Organism:Homo sapiens (Human)
Description:P52333
Residue:1124
BDBM50383274
NameBDBM50383274
Synonyms:CHEMBL1229592 US9670213, WZ4002
TypeSmall organic molecule
Emp. Form.C25H27ClN6O3
Mol. Mass.494.973
SMILESCOc1cc(ccc1Nc1ncc(Cl)c(Oc2cccc(NC(=O)C=C)c2)n1)N1CCN(C)CC1