Reaction Details
TargetHistone-lysine N-methyltransferase EZH2
LigandBDBM50110354
Substrate/Competitorn/a
Meas. Tech.ChEMBL_1511673 (CHEMBL3607426)
IC50 40±n/a nM
Citation Gehling, VSVaswani, RGNasveschuk, CGDuplessis, MIyer, PBalasubramanian, SZhao, FGood, ACCampbell, RLee, CDakin, LACook, ASGagnon, AHarmange, JCAudia, JECummings, RTNormant, ETrojer, PAlbrecht, BK Discovery, design, and synthesis of indole-based EZH2 inhibitors. Bioorg Med Chem Lett25:3644-9 (2015) 
 
Histone-lysine N-methyltransferase EZH2
Name:Histone-lysine N-methyltransferase EZH2
Type:Protein
Mol. Mass.:85367.84
Organism:Homo sapiens (Human)
Description:Q15910
Residue:746
BDBM50110354
NameBDBM50110354
Synonyms:CHEMBL3605458
TypeSmall organic molecule
Emp. Form.C29H40N4O4S
Mol. Mass.540.717
SMILESCCCc1cc(C)[nH]c(=O)c1CNC(=O)c1c(C)n([C@H](C)C2CCN(CC2)S(=O)(=O)CC)c2ccccc12