Reaction Details
TargetHistone-lysine N-methyltransferase EZH2
LigandBDBM50110350
Substrate/Competitorn/a
Meas. Tech.ChEMBL_1511673 (CHEMBL3607426)
IC50 34±n/a nM
Citation Gehling, VSVaswani, RGNasveschuk, CGDuplessis, MIyer, PBalasubramanian, SZhao, FGood, ACCampbell, RLee, CDakin, LACook, ASGagnon, AHarmange, JCAudia, JECummings, RTNormant, ETrojer, PAlbrecht, BK Discovery, design, and synthesis of indole-based EZH2 inhibitors. Bioorg Med Chem Lett25:3644-9 (2015) 
 
Histone-lysine N-methyltransferase EZH2
Name:Histone-lysine N-methyltransferase EZH2
Type:Protein
Mol. Mass.:85367.84
Organism:Homo sapiens (Human)
Description:Q15910
Residue:746
BDBM50110350
NameBDBM50110350
Synonyms:CHEMBL3605446
TypeSmall organic molecule
Emp. Form.C26H27N3O2
Mol. Mass.413.5115
SMILESC[C@H](c1ccccc1)n1c(C)c(C(=O)NCc2c(C)cc(C)[nH]c2=O)c2ccccc12