Reaction Details
TargetHistone-lysine N-methyltransferase EZH2
LigandBDBM50110370
Substrate/Competitorn/a
Meas. Tech.ChEMBL_1511672 (CHEMBL3607425)
IC50 94±n/a nM
Citation Gehling, VSVaswani, RGNasveschuk, CGDuplessis, MIyer, PBalasubramanian, SZhao, FGood, ACCampbell, RLee, CDakin, LACook, ASGagnon, AHarmange, JCAudia, JECummings, RTNormant, ETrojer, PAlbrecht, BK Discovery, design, and synthesis of indole-based EZH2 inhibitors. Bioorg Med Chem Lett25:3644-9 (2015) 
 
Histone-lysine N-methyltransferase EZH2
Name:Histone-lysine N-methyltransferase EZH2
Type:Protein
Mol. Mass.:85367.84
Organism:Homo sapiens (Human)
Description:Q15910
Residue:746
BDBM50110370
NameBDBM50110370
Synonyms:CHEMBL3605442
TypeSmall organic molecule
Emp. Form.C22H23N3O3
Mol. Mass.377.4363
SMILESCC(c1ccccc1)n1ccc(cc1=O)C(=O)NCc1c(C)cc(C)[nH]c1=O