Reaction Details
TargetHistone-lysine N-methyltransferase EZH2
LigandBDBM50110358
Substrate/Competitorn/a
Meas. Tech.ChEMBL_1511674 (CHEMBL3607427)
IC50 568±n/a nM
Citation Gehling, VSVaswani, RGNasveschuk, CGDuplessis, MIyer, PBalasubramanian, SZhao, FGood, ACCampbell, RLee, CDakin, LACook, ASGagnon, AHarmange, JCAudia, JECummings, RTNormant, ETrojer, PAlbrecht, BK Discovery, design, and synthesis of indole-based EZH2 inhibitors. Bioorg Med Chem Lett25:3644-9 (2015) 
 
Histone-lysine N-methyltransferase EZH2
Name:Histone-lysine N-methyltransferase EZH2
Type:Protein
Mol. Mass.:85367.84
Organism:Homo sapiens (Human)
Description:Q15910
Residue:746
BDBM50110358
NameBDBM50110358
Synonyms:CHEMBL3605454
TypeSmall organic molecule
Emp. Form.C26H34N4O2
Mol. Mass.434.5738
SMILESC[C@H](C1CCN(C)CC1)n1c(C)c(C(=O)NCc2c(C)cc(C)[nH]c2=O)c2ccccc12