Reaction Details
TargetHistone-lysine N-methyltransferase EZH2
LigandBDBM50110357
Substrate/Competitorn/a
Meas. Tech.ChEMBL_1511674 (CHEMBL3607427)
IC50 59±n/a nM
Citation Gehling, VSVaswani, RGNasveschuk, CGDuplessis, MIyer, PBalasubramanian, SZhao, FGood, ACCampbell, RLee, CDakin, LACook, ASGagnon, AHarmange, JCAudia, JECummings, RTNormant, ETrojer, PAlbrecht, BK Discovery, design, and synthesis of indole-based EZH2 inhibitors. Bioorg Med Chem Lett25:3644-9 (2015) 
 
Histone-lysine N-methyltransferase EZH2
Name:Histone-lysine N-methyltransferase EZH2
Type:Protein
Mol. Mass.:85367.84
Organism:Homo sapiens (Human)
Description:Q15910
Residue:746
BDBM50110357
NameBDBM50110357
Synonyms:CHEMBL3605455
TypeSmall organic molecule
Emp. Form.C27H36N4O4S
Mol. Mass.512.664
SMILESCCS(=O)(=O)N1CCC(CC1)[C@@H](C)n1c(C)c(C(=O)NCc2c(C)cc(C)[nH]c2=O)c2ccccc12