Reaction Details
TargetHistone-lysine N-methyltransferase EZH2
LigandBDBM50110356
Substrate/Competitorn/a
Meas. Tech.ChEMBL_1511674 (CHEMBL3607427)
IC50 75±n/a nM
Citation Gehling, VSVaswani, RGNasveschuk, CGDuplessis, MIyer, PBalasubramanian, SZhao, FGood, ACCampbell, RLee, CDakin, LACook, ASGagnon, AHarmange, JCAudia, JECummings, RTNormant, ETrojer, PAlbrecht, BK Discovery, design, and synthesis of indole-based EZH2 inhibitors. Bioorg Med Chem Lett25:3644-9 (2015) 
 
Histone-lysine N-methyltransferase EZH2
Name:Histone-lysine N-methyltransferase EZH2
Type:Protein
Mol. Mass.:85367.84
Organism:Homo sapiens (Human)
Description:Q15910
Residue:746
BDBM50110356
NameBDBM50110356
Synonyms:CHEMBL3605456
TypeSmall organic molecule
Emp. Form.C25H31N3O4
Mol. Mass.437.5313
SMILESCOc1cc(C)[nH]c(=O)c1CNC(=O)c1c(C)n([C@H](C)C2CCOCC2)c2ccccc12