Reaction Details
TargetPoly [ADP-ribose] polymerase 1
LigandBDBM50110841
Substrate/Competitorn/a
Meas. Tech.ChEMBL_1510424 (CHEMBL3607349)
IC50>10000±n/a nM
Citation Papeo, GPosteri, HBorghi, DBusel, AACaprera, FCasale, ECiomei, MCirla, ACorti, ED'Anello, MFasolini, MForte, BGalvani, AIsacchi, AKhvat, AKrasavin, MYLupi, ROrsini, PPerego, RPesenti, EPezzetta, DRainoldi, SRiccardi-Sirtori, FScolaro, ASola, FZuccotto, FFelder, ERDonati, DMontagnoli, A Discovery of 2-[1-(4,4-Difluorocyclohexyl)piperidin-4-yl]-6-fluoro-3-oxo-2,3-dihydro-1H-isoindole-4-carboxamide (NMS-P118): A Potent, Orally Available, and Highly Selective PARP-1 Inhibitor for Cancer Therapy. J Med Chem58:6875-98 (2015) 
 
Poly [ADP-ribose] polymerase 1
Name:Poly [ADP-ribose] polymerase 1
Type:n/a
Mol. Mass.:113114.22
Organism:Homo sapiens (Human)
Description:P09874
Residue:1014
BDBM50110841
NameBDBM50110841
Synonyms:CHEMBL3605999
TypeSmall organic molecule
Emp. Form.C21H22BrN3O2
Mol. Mass.428.322
SMILESNC(=O)c1cccc2CN(C3CCN(Cc4ccccc4Br)CC3)C(=O)c12