Reaction Details
TargetPoly [ADP-ribose] polymerase 1
LigandBDBM50110811
Substrate/Competitorn/a
Meas. Tech.ChEMBL_1510424 (CHEMBL3607349)
IC50 1000±n/a nM
Citation Papeo, GPosteri, HBorghi, DBusel, AACaprera, FCasale, ECiomei, MCirla, ACorti, ED'Anello, MFasolini, MForte, BGalvani, AIsacchi, AKhvat, AKrasavin, MYLupi, ROrsini, PPerego, RPesenti, EPezzetta, DRainoldi, SRiccardi-Sirtori, FScolaro, ASola, FZuccotto, FFelder, ERDonati, DMontagnoli, A Discovery of 2-[1-(4,4-Difluorocyclohexyl)piperidin-4-yl]-6-fluoro-3-oxo-2,3-dihydro-1H-isoindole-4-carboxamide (NMS-P118): A Potent, Orally Available, and Highly Selective PARP-1 Inhibitor for Cancer Therapy. J Med Chem58:6875-98 (2015) 
 
Poly [ADP-ribose] polymerase 1
Name:Poly [ADP-ribose] polymerase 1
Type:n/a
Mol. Mass.:113114.22
Organism:Homo sapiens (Human)
Description:P09874
Residue:1014
BDBM50110811
NameBDBM50110811
Synonyms:CHEMBL3606010 US11420940, cpd (13)
TypeSmall organic molecule
Emp. Form.C19H21N3O2S
Mol. Mass.355.454
SMILESNC(=O)c1cccc2CN(C3CCN(Cc4ccsc4)CC3)C(=O)c12