Reaction Details
TargetPoly [ADP-ribose] polymerase 2
LigandBDBM50110823
Substrate/Competitorn/a
Meas. Tech.ChEMBL_1510422 (CHEMBL3607347)
Kd 422±n/a nM
Citation Papeo, GPosteri, HBorghi, DBusel, AACaprera, FCasale, ECiomei, MCirla, ACorti, ED'Anello, MFasolini, MForte, BGalvani, AIsacchi, AKhvat, AKrasavin, MYLupi, ROrsini, PPerego, RPesenti, EPezzetta, DRainoldi, SRiccardi-Sirtori, FScolaro, ASola, FZuccotto, FFelder, ERDonati, DMontagnoli, A Discovery of 2-[1-(4,4-Difluorocyclohexyl)piperidin-4-yl]-6-fluoro-3-oxo-2,3-dihydro-1H-isoindole-4-carboxamide (NMS-P118): A Potent, Orally Available, and Highly Selective PARP-1 Inhibitor for Cancer Therapy. J Med Chem58:6875-98 (2015) 
 
Poly [ADP-ribose] polymerase 2
Name:Poly [ADP-ribose] polymerase 2
Type:Enzyme
Mol. Mass.:66225.70
Organism:Homo sapiens (Human)
Description:Q9UGN5
Residue:583
BDBM50110823
NameBDBM50110823
Synonyms:CHEMBL1329044
TypeSmall organic molecule
Emp. Form.C12H14N2O2
Mol. Mass.218.2518
SMILESCCCN1Cc2cccc(C(N)=O)c2C1=O