Reaction Details
TargetPoly [ADP-ribose] polymerase 1
LigandBDBM50110824
Substrate/Competitorn/a
Meas. Tech.ChEMBL_1510421 (CHEMBL3607346)
Kd 87±n/a nM
Citation Papeo, GPosteri, HBorghi, DBusel, AACaprera, FCasale, ECiomei, MCirla, ACorti, ED'Anello, MFasolini, MForte, BGalvani, AIsacchi, AKhvat, AKrasavin, MYLupi, ROrsini, PPerego, RPesenti, EPezzetta, DRainoldi, SRiccardi-Sirtori, FScolaro, ASola, FZuccotto, FFelder, ERDonati, DMontagnoli, A Discovery of 2-[1-(4,4-Difluorocyclohexyl)piperidin-4-yl]-6-fluoro-3-oxo-2,3-dihydro-1H-isoindole-4-carboxamide (NMS-P118): A Potent, Orally Available, and Highly Selective PARP-1 Inhibitor for Cancer Therapy. J Med Chem58:6875-98 (2015) 
 
Poly [ADP-ribose] polymerase 1
Name:Poly [ADP-ribose] polymerase 1
Type:n/a
Mol. Mass.:113114.22
Organism:Homo sapiens (Human)
Description:P09874
Residue:1014
BDBM50110824
NameBDBM50110824
Synonyms:CHEMBL3605967
TypeSmall organic molecule
Emp. Form.C13H16N2O3
Mol. Mass.248.2777
SMILESCOCCCN1Cc2cccc(C(N)=O)c2C1=O