Reaction Details
TargetSerine/threonine-protein kinase NIM1
LigandBDBM138348
Substrate/Competitorn/a
Meas. Tech.ChEMBL_1510633 (CHEMBL3608084)
IC50>10000±n/a nM
Citation Papeo, GPosteri, HBorghi, DBusel, AACaprera, FCasale, ECiomei, MCirla, ACorti, ED'Anello, MFasolini, MForte, BGalvani, AIsacchi, AKhvat, AKrasavin, MYLupi, ROrsini, PPerego, RPesenti, EPezzetta, DRainoldi, SRiccardi-Sirtori, FScolaro, ASola, FZuccotto, FFelder, ERDonati, DMontagnoli, A Discovery of 2-[1-(4,4-Difluorocyclohexyl)piperidin-4-yl]-6-fluoro-3-oxo-2,3-dihydro-1H-isoindole-4-carboxamide (NMS-P118): A Potent, Orally Available, and Highly Selective PARP-1 Inhibitor for Cancer Therapy. J Med Chem58:6875-98 (2015) 
 
Serine/threonine-protein kinase NIM1
Name:Serine/threonine-protein kinase NIM1
Type:PROTEIN
Mol. Mass.:49617.55
Organism:Homo sapiens (Human)
Description:ChEMBL_1510633
Residue:436
BDBM138348
NameBDBM138348
Synonyms:US8877944, 99
TypeSmall organic molecule
Emp. Form.C20H24F3N3O2
Mol. Mass.395.4187
SMILESNC(=O)c1cc(F)cc2CN(C3CCN(CC3)C3CCC(F)(F)CC3)C(=O)c12