Reaction Details
TargetPoly [ADP-ribose] polymerase 2
LigandBDBM138298
Substrate/Competitorn/a
Meas. Tech.ChEMBL_1510446 (CHEMBL3607371)
Kd 1219±n/a nM
Citation Papeo, GPosteri, HBorghi, DBusel, AACaprera, FCasale, ECiomei, MCirla, ACorti, ED'Anello, MFasolini, MForte, BGalvani, AIsacchi, AKhvat, AKrasavin, MYLupi, ROrsini, PPerego, RPesenti, EPezzetta, DRainoldi, SRiccardi-Sirtori, FScolaro, ASola, FZuccotto, FFelder, ERDonati, DMontagnoli, A Discovery of 2-[1-(4,4-Difluorocyclohexyl)piperidin-4-yl]-6-fluoro-3-oxo-2,3-dihydro-1H-isoindole-4-carboxamide (NMS-P118): A Potent, Orally Available, and Highly Selective PARP-1 Inhibitor for Cancer Therapy. J Med Chem58:6875-98 (2015) 
 
Poly [ADP-ribose] polymerase 2
Name:Poly [ADP-ribose] polymerase 2
Type:Enzyme
Mol. Mass.:66225.70
Organism:Homo sapiens (Human)
Description:Q9UGN5
Residue:583
BDBM138298
NameBDBM138298
Synonyms:US8877944, 7
TypeSmall organic molecule
Emp. Form.C20H25F2N3O2
Mol. Mass.377.4282
SMILESNC(=O)c1cccc2CN(C3CCN(CC3)C3CCC(F)(F)CC3)C(=O)c12