Reaction Details
TargetRibosomal protein S6 kinase alpha-3
LigandBDBM50111371
Substrate/Competitorn/a
Meas. Tech.ChEMBL_1509948 (CHEMBL3607766)
EC50>20000±n/a nM
Citation Jain, RMathur, MLan, JCostales, AAtallah, GRamurthy, SSubramanian, SSetti, LFeucht, PWarne, BDoyle, LBasham, SJefferson, ABLindvall, MAppleton, BAShafer, CM Discovery of Potent and Selective RSK Inhibitors as Biological Probes. J Med Chem58:6766-83 (2015) 
 
Ribosomal protein S6 kinase alpha-3
Name:Ribosomal protein S6 kinase alpha-3
Type:PROTEIN
Mol. Mass.:83697.95
Organism:Mus musculus
Description:ChEMBL_108393
Residue:740
BDBM50111371
NameBDBM50111371
Synonyms:CHEMBL3604772
TypeSmall organic molecule
Emp. Form.C15H12N2O
Mol. Mass.236.2686
SMILESOc1ccc(cc1)-c1[nH]ncc1-c1ccccc1