Reaction Details
TargetRibosomal protein S6 kinase alpha-3
LigandBDBM50111383
Substrate/Competitorn/a
Meas. Tech.ChEMBL_1509947 (CHEMBL3607765)
IC50 80±n/a nM
Citation Jain, RMathur, MLan, JCostales, AAtallah, GRamurthy, SSubramanian, SSetti, LFeucht, PWarne, BDoyle, LBasham, SJefferson, ABLindvall, MAppleton, BAShafer, CM Discovery of Potent and Selective RSK Inhibitors as Biological Probes. J Med Chem58:6766-83 (2015) 
 
Ribosomal protein S6 kinase alpha-3
Name:Ribosomal protein S6 kinase alpha-3
Type:Serine/threonine-protein kinase
Mol. Mass.:83740.03
Organism:Homo sapiens (Human)
Description:The human RSK2 sequence differed from the Genbank entry NM_004586 at one residue, V45G. The protein was cloned and purified from baculovirus expression system.
Residue:740
BDBM50111383
NameBDBM50111383
Synonyms:CHEMBL3604795
TypeSmall organic molecule
Emp. Form.C17H12F2N2O2
Mol. Mass.314.2862
SMILESCOc1ccc(cn1)-c1ccncc1-c1cc(F)c(O)c(F)c1