Reaction Details
TargetRibosomal protein S6 kinase alpha-3
LigandBDBM50111392
Substrate/Competitorn/a
Meas. Tech.ChEMBL_1509948 (CHEMBL3607766)
EC50 2300±n/a nM
Citation Jain, RMathur, MLan, JCostales, AAtallah, GRamurthy, SSubramanian, SSetti, LFeucht, PWarne, BDoyle, LBasham, SJefferson, ABLindvall, MAppleton, BAShafer, CM Discovery of Potent and Selective RSK Inhibitors as Biological Probes. J Med Chem58:6766-83 (2015) 
 
Ribosomal protein S6 kinase alpha-3
Name:Ribosomal protein S6 kinase alpha-3
Type:PROTEIN
Mol. Mass.:83697.95
Organism:Mus musculus
Description:ChEMBL_108393
Residue:740
BDBM50111392
NameBDBM50111392
Synonyms:CHEMBL3604786
TypeSmall organic molecule
Emp. Form.C21H18F2N2O2
Mol. Mass.368.3766
SMILESOc1c(F)cc(cc1F)-c1cnccc1-c1cccc(c1)N1CCOCC1