Reaction Details
TargetRibosomal protein S6 kinase alpha-3
LigandBDBM50111376
Substrate/Competitorn/a
Meas. Tech.ChEMBL_1509948 (CHEMBL3607766)
EC50 690±n/a nM
Citation Jain, RMathur, MLan, JCostales, AAtallah, GRamurthy, SSubramanian, SSetti, LFeucht, PWarne, BDoyle, LBasham, SJefferson, ABLindvall, MAppleton, BAShafer, CM Discovery of Potent and Selective RSK Inhibitors as Biological Probes. J Med Chem58:6766-83 (2015) 
 
Ribosomal protein S6 kinase alpha-3
Name:Ribosomal protein S6 kinase alpha-3
Type:PROTEIN
Mol. Mass.:83697.95
Organism:Mus musculus
Description:ChEMBL_108393
Residue:740
BDBM50111376
NameBDBM50111376
Synonyms:CHEMBL3604886
TypeSmall organic molecule
Emp. Form.C18H15F2N3O
Mol. Mass.327.328
SMILESCNc1ncc(-c2cc(F)c(O)c(F)c2)c(n1)-c1ccc(C)cc1